{"text_format":"1","workbook":"xlsx","n_sheets":35,"sheets":["Tablas","INICIO","DIAGNÓSTICO DE UE","INFORMACIÓN INICIAL","DIAGNOSTICO DEL INCISO","RA COM","RA VISION","RA PART","RA SOPORTE","RA AP","RA ET","Registro de actividad","ACTIVIDADES","Registro de actores","ACTORES","Registro de impactos","IMPACTOS","Estrategia de capacitación","Estrategia de comunicación","UE 1","UE 2","UE 3","UE 4","UE 5","UE 6","UE 7","UE 8","UE 9","UE 10","UE 11","UE 12","Tablero de Actividades","Tablero de impactos","Tablero de Seguimiento","Tablas Tablero"],"not_rendered":{"charts":1,"images":5,"macros":1,"external_links":1,"defined_names":36,"comments":1,"pivot_tables":0},"unopened":[],"bounds":{"document_bytes":16777216,"sheet_cells":100000,"rows_first":2000,"rows_last":500,"rows_between":2000,"halvings":0,"cell_chars":16384,"cell_head_chars":4096},"cells_cut":0,"cells_raw":0,"read":"whole","date_system":"1900"}

{"sheet":"Tablas","index":0,"n_rows":227,"n_cols":4,"rows_kept":227,"cut":false,"hidden":false,"merged":[[129,1,137,1],[129,2,137,2],[47,1,48,1],[49,1,55,1],[39,1,46,1],[56,2,61,2],[62,2,70,2],[71,2,77,2],[121,1,128,1],[102,1,120,1],[97,1,101,1],[86,1,96,1],[78,1,85,1],[78,2,85,2],[86,2,96,2],[97,2,101,2],[30,1,38,1],[2,1,29,1],[71,1,77,1],[62,1,70,1],[56,1,61,1],[102,2,120,2],[121,2,128,2],[2,2,29,2],[30,2,38,2],[39,2,46,2],[47,2,48,2],[49,2,55,2]]}
[]
[]
[null,"Ministerio del Interior","MINT","Centro Nacional de Rehabilitación"]
[null,null,null,"Dirección de Asuntos Internos"]
[null,null,null,"Dirección General de Información e Inteligencia"]
[null,null,null,"Dirección General de Lucha contra el Crimen Organizado e INTERPOL"]
[null,null,null,"Dirección General de Represión del Tráfico Ilícito de Drogas"]
[null,null,null,"Dirección General de Secretaria"]
{"$rows_left_out":220}
{"sheet":"INICIO","index":1,"n_rows":0,"n_cols":0,"rows_kept":0,"cut":false,"hidden":false,"merged":[]}

{"sheet":"DIAGNÓSTICO DE UE","index":2,"n_rows":20,"n_cols":6,"rows_kept":20,"cut":false,"hidden":false,"merged":[[15,3,15,4],[4,3,4,9],[8,3,8,4],[9,3,9,4],[10,3,10,4],[11,3,11,4],[12,3,12,4],[13,3,13,4],[14,3,14,4],[29,6,29,7],[16,3,16,4],[17,3,17,4],[18,3,18,4],[18,7,20,10],[19,3,19,4],[23,6,23,7],[24,6,24,7],[25,6,25,7],[26,6,26,7],[27,6,27,7],[28,6,28,7],[41,6,41,7],[30,6,30,7],[31,6,31,7],[32,6,32,7],[33,6,33,7],[34,6,34,7],[35,6,35,7],[36,6,36,7],[37,6,37,7],[38,6,38,7],[39,6,39,7],[40,6,40,7],[53,6,53,7],[42,6,42,7],[43,6,43,7],[44,6,44,7],[45,6,45,7],[46,6,46,7],[47,6,47,7],[48,6,48,7],[49,6,49,7],[50,6,50,7],[51,6,51,7],[52,6,52,7],[65,6,65,7],[54,6,54,7],[55,6,55,7],[56,6,56,7],[57,6,57,7],[58,6,58,7],[59,6,59,7],[60,6,60,7],[61,6,61,7],[62,6,62,7],[63,6,63,7],[64,6,64,7],[77,6,77,7],[66,6,66,7],[67,6,67,7],[68,6,68,7],[69,6,69,7],[70,6,70,7],[71,6,71,7],[72,6,72,7],[73,6,73,7],[74,6,74,7],[75,6,75,7],[76,6,76,7],[89,6,89,7],[78,6,78,7],[79,6,79,7],[80,6,80,7],[81,6,81,7],[82,6,82,7],[83,6,83,7],[84,6,84,7],[85,6,85,7],[86,6,86,7],[87,6,87,7],[88,6,88,7],[96,6,96,7],[90,6,90,7],[91,6,91,7],[92,6,92,7],[93,6,93,7],[94,6,94,7],[95,6,95,7]]}
[]
[]
[]
[]
[null,null,null,"Diagnóstico de las Unidades Ejecutoras"]
[null,null,null,"(Para agragar información del Diagnóstico de la UE  presionar        ) "]
[]
[null,null,null,"Unidades Ejecutoras "]
{"$rows_left_out":13}
{"sheet":"INFORMACIÓN INICIAL","index":3,"n_rows":98,"n_cols":13,"rows_kept":98,"cut":false,"hidden":false,"merged":[[15,10,15,11],[12,8,12,9],[13,8,13,9],[15,12,15,13],[16,12,16,13],[4,11,4,13],[23,8,23,11],[10,12,10,13],[11,12,11,13],[12,12,12,13],[13,12,13,13],[14,12,14,13],[5,12,5,13],[6,12,6,13],[7,12,7,13],[8,12,8,13],[9,12,9,13],[14,8,14,9],[15,8,15,9],[16,8,16,9],[5,10,5,11],[6,10,6,11],[7,10,7,11],[8,10,8,11],[3,3,3,9],[6,3,6,4],[5,3,5,4],[9,3,9,4],[4,7,4,10],[10,3,10,4],[11,3,11,4],[12,3,12,4],[13,3,13,4],[5,8,5,9],[6,8,6,9],[7,8,7,9],[8,8,8,9],[12,10,12,11],[13,10,13,11],[9,10,9,11],[16,10,16,11],[9,8,9,9],[10,8,10,9],[11,8,11,9],[17,3,17,4],[29,6,29,7],[30,6,30,7],[24,6,24,7],[28,6,28,7],[25,6,25,7],[26,6,26,7],[27,6,27,7],[18,3,18,4],[19,3,19,4],[20,3,20,4],[19,7,21,13],[10,10,10,11],[11,10,11,11],[18,7,18,10],[18,11,18,13],[14,3,14,4],[15,3,15,4],[16,3,16,4],[14,10,14,11],[33,6,33,7],[34,6,34,7],[31,6,31,7],[32,6,32,7],[37,6,37,7],[38,6,38,7],[35,6,35,7],[36,6,36,7],[41,6,41,7],[42,6,42,7],[39,6,39,7],[40,6,40,7],[45,6,45,7],[46,6,46,7],[43,6,43,7],[44,6,44,7],[49,6,49,7],[50,6,50,7],[47,6,47,7],[48,6,48,7],[53,6,53,7],[54,6,54,7],[51,6,51,7],[52,6,52,7],[57,6,57,7],[58,6,58,7],[55,6,55,7],[56,6,56,7],[61,6,61,7],[62,6,62,7],[59,6,59,7],[60,6,60,7],[65,6,65,7],[66,6,66,7],[63,6,63,7],[64,6,64,7],[69,6,69,7],[70,6,70,7],[67,6,67,7],[68,6,68,7],[73,6,73,7],[74,6,74,7],[71,6,71,7],[72,6,72,7],[77,6,77,7],[78,6,78,7],[75,6,75,7],[76,6,76,7],[81,6,81,7],[82,6,82,7],[79,6,79,7],[80,6,80,7],[85,6,85,7],[91,6,91,7],[92,6,92,7],[97,6,97,7],[95,6,95,7],[96,6,96,7],[93,6,93,7],[94,6,94,7],[86,6,86,7],[83,6,83,7],[84,6,84,7],[89,6,89,7],[90,6,90,7],[87,6,87,7],[88,6,88,7]]}
[]
[]
[]
[null,null,null,"Información INICIAL"]
[null,null,null,null,null,null,null,"Equipo de proyecto"]
[null,null,null,"Inciso",null,null,null,"Rol",{"$f":"B10","v":" "},null,"CONSULTORA",null,"AGESIC"]
[null,null,null,null,null,null,null,"Patrocinador"]
[null,null,null,null,null,null,null,"Referente o PM"]
{"$rows_left_out":91}
{"sheet":"DIAGNOSTICO DEL INCISO","index":4,"n_rows":24,"n_cols":8,"rows_kept":24,"cut":false,"hidden":false,"merged":[[12,8,12,13],[11,8,11,13],[12,2,12,7],[7,2,7,7],[9,2,9,7],[11,2,11,7],[10,2,10,7],[8,2,8,7],[4,1,4,7],[22,2,22,3],[23,2,23,3],[17,2,17,3],[18,2,18,3],[19,2,19,3],[20,2,20,3],[21,2,21,3],[16,4,16,5]]}
[]
[]
[]
[]
[null,"Diagnóstico y estrategia para el INCISO"]
[]
[]
[null,null,"1. DESCRIPCIÓN DEL CAMBIO (¿En qué consiste el cambio propuesto?)"]
{"$rows_left_out":17}
{"sheet":"RA COM","index":5,"n_rows":28,"n_cols":8,"rows_kept":28,"cut":false,"hidden":false,"merged":[[21,2,21,3]]}
[]
[]
[]
[]
[null,null,"Registro de ACTIVIDAD"]
[]
[]
[null,null,null,"Identificador",null,{"$f":"COUNT(ACTIVIDADES!C11:C1048576)+1","v":1}]
{"$rows_left_out":21}
{"sheet":"RA VISION","index":6,"n_rows":28,"n_cols":8,"rows_kept":28,"cut":false,"hidden":false,"merged":[[21,2,21,3]]}
[]
[]
[]
[]
[null,null,"Registro de ACTIVIDAD"]
[]
[]
[null,null,null,"Identificador",null,{"$f":"COUNT(ACTIVIDADES!C11:C1048576)+1","v":1}]
{"$rows_left_out":21}
{"sheet":"RA PART","index":7,"n_rows":28,"n_cols":8,"rows_kept":28,"cut":false,"hidden":false,"merged":[[21,2,21,3]]}
[]
[]
[]
[]
[null,null,"Registro de ACTIVIDAD"]
[]
[]
[null,null,null,"Identificador",null,{"$f":"COUNT(ACTIVIDADES!C11:C1048576)+1","v":1}]
{"$rows_left_out":21}
{"sheet":"RA SOPORTE","index":8,"n_rows":28,"n_cols":8,"rows_kept":28,"cut":false,"hidden":false,"merged":[[21,2,21,3]]}
[]
[]
[]
[]
[null,null,"Registro de ACTIVIDAD"]
[]
[]
[null,null,null,"Identificador",null,{"$f":"COUNT(ACTIVIDADES!C11:C1048576)+1","v":1}]
{"$rows_left_out":21}
{"sheet":"RA AP","index":9,"n_rows":28,"n_cols":8,"rows_kept":28,"cut":false,"hidden":false,"merged":[[21,2,21,3]]}
[]
[]
[]
[]
[null,null,"Registro de ACTIVIDAD"]
[]
[]
[null,null,null,"Identificador",null,{"$f":"COUNT(ACTIVIDADES!C11:C1048576)+1","v":1}]
{"$rows_left_out":21}
{"sheet":"RA ET","index":10,"n_rows":28,"n_cols":8,"rows_kept":28,"cut":false,"hidden":false,"merged":[[21,2,21,3]]}
[]
[]
[]
[]
[null,null,"Registro de ACTIVIDAD"]
[]
[]
[null,null,null,"Identificador",null,{"$f":"COUNT(ACTIVIDADES!C11:C1048576)+1","v":1}]
{"$rows_left_out":21}
{"sheet":"Registro de actividad","index":11,"n_rows":28,"n_cols":8,"rows_kept":28,"cut":false,"hidden":false,"merged":[[21,2,21,3]]}
[]
[]
[]
[]
[null,null,"Registro de ACTIVIDAD"]
[]
[]
[null,null,null,"Identificador",null,{"$f":"COUNT(ACTIVIDADES!C11:C1048576)+1","v":1}]
{"$rows_left_out":21}
{"sheet":"ACTIVIDADES","index":12,"n_rows":11,"n_cols":17,"rows_kept":11,"cut":false,"hidden":false,"merged":[]}
[]
[]
[]
[]
[null,null,"Tabla de ACTIVIDADES"]
[]
[]
[]
{"$rows_left_out":4}
{"sheet":"Registro de actores","index":13,"n_rows":42,"n_cols":8,"rows_kept":42,"cut":false,"hidden":false,"merged":[[29,3,29,6],[35,3,35,6],[38,4,38,6],[38,7,38,9],[39,4,39,6],[39,7,39,9],[32,4,32,6],[33,4,33,6],[36,4,36,6],[36,7,36,9],[37,4,37,6],[37,7,37,9],[30,4,30,6],[31,4,31,6],[41,4,41,6],[41,7,41,9],[40,4,40,6],[40,7,40,9]]}
[]
[]
[]
[]
[null,null,"Registro de ACTOR"]
[]
[]
[]
{"$rows_left_out":35}
{"sheet":"ACTORES","index":14,"n_rows":9,"n_cols":12,"rows_kept":9,"cut":false,"hidden":false,"merged":[]}
[]
[]
[]
[]
[null,null,"Tabla de ACTORES"]
[]
[]
[]
{"$rows_left_out":2}
{"sheet":"Registro de impactos","index":15,"n_rows":39,"n_cols":9,"rows_kept":39,"cut":false,"hidden":false,"merged":[[38,2,38,3],[32,2,32,3],[33,2,33,3],[34,2,34,3],[35,2,35,3],[36,2,36,3],[37,2,37,3]]}
[]
[]
[]
[]
[null,null,"Registro de IMPACTO"]
[]
[]
[null,null,null,"Identificador",null,{"$f":"COUNT(IMPACTOS!C11:C1048576)+1","v":1},null," "]
{"$rows_left_out":32}
{"sheet":"IMPACTOS","index":16,"n_rows":9,"n_cols":13,"rows_kept":9,"cut":false,"hidden":false,"merged":[]}
[]
[]
[]
[]
[null,null,"Tabla de IMPACTOS"]
[]
[]
[]
{"$rows_left_out":2}
{"sheet":"Estrategia de capacitación","index":17,"n_rows":24,"n_cols":3,"rows_kept":24,"cut":false,"hidden":false,"merged":[[7,2,7,3],[12,2,12,3]]}
[]
[]
[]
[]
[null,null,"Estrategia de CAPACITACIÓN"]
[]
[]
[null,null,"DIMENSIÓN DE LA CAPACITACIÓN"]
{"$rows_left_out":17}
{"sheet":"Estrategia de comunicación","index":18,"n_rows":24,"n_cols":6,"rows_kept":24,"cut":false,"hidden":false,"merged":[[12,3,12,5],[13,3,13,5],[14,3,14,5],[15,3,15,5],[7,2,7,5],[8,3,8,5],[9,3,9,5],[10,3,10,5],[11,3,11,5]]}
[]
[]
[]
[]
[null,null,"Estrategia de COMUNICACIÓN"]
[]
[]
[null,null," En qué consiste su estrategia general en términos de:  "]
{"$rows_left_out":17}
{"sheet":"UE 1","index":19,"n_rows":36,"n_cols":7,"rows_kept":36,"cut":false,"hidden":false,"merged":[[33,2,33,3],[34,2,34,3],[35,2,35,3],[28,2,28,4],[29,2,29,3],[30,2,30,3],[31,2,31,3],[32,2,32,3]]}
[]
[]
[]
[]
[]
[null,{"$f":"'INFORMACIÓN INICIAL'!D10","v":0}]
[]
[]
{"$rows_left_out":29}
{"sheet":"UE 2","index":20,"n_rows":36,"n_cols":7,"rows_kept":36,"cut":false,"hidden":false,"merged":[[34,2,34,3],[35,2,35,3],[28,2,28,4],[29,2,29,3],[30,2,30,3],[31,2,31,3],[32,2,32,3],[33,2,33,3]]}
[]
[]
[]
[]
[]
[null,{"$f":"'INFORMACIÓN INICIAL'!D11","v":0}]
[]
[]
{"$rows_left_out":29}
{"sheet":"UE 3","index":21,"n_rows":36,"n_cols":7,"rows_kept":36,"cut":false,"hidden":false,"merged":[[34,2,34,3],[35,2,35,3],[28,2,28,4],[29,2,29,3],[30,2,30,3],[31,2,31,3],[32,2,32,3],[33,2,33,3]]}
[]
[]
[]
[]
[]
[null,{"$f":"'INFORMACIÓN INICIAL'!D12","v":0}]
[]
[]
{"$rows_left_out":29}
{"sheet":"UE 4","index":22,"n_rows":36,"n_cols":7,"rows_kept":36,"cut":false,"hidden":false,"merged":[[34,2,34,3],[35,2,35,3],[28,2,28,4],[29,2,29,3],[30,2,30,3],[31,2,31,3],[32,2,32,3],[33,2,33,3]]}
[]
[]
[]
[]
[]
[null,{"$f":"'INFORMACIÓN INICIAL'!D13","v":0}]
[]
[]
{"$rows_left_out":29}
{"sheet":"UE 5","index":23,"n_rows":36,"n_cols":7,"rows_kept":36,"cut":false,"hidden":false,"merged":[[34,2,34,3],[35,2,35,3],[28,2,28,4],[29,2,29,3],[30,2,30,3],[31,2,31,3],[32,2,32,3],[33,2,33,3]]}
[]
[]
[]
[]
[]
[null,{"$f":"'INFORMACIÓN INICIAL'!D14","v":0}]
[]
[]
{"$rows_left_out":29}
{"sheet":"UE 6","index":24,"n_rows":36,"n_cols":7,"rows_kept":36,"cut":false,"hidden":false,"merged":[[34,2,34,3],[35,2,35,3],[28,2,28,4],[29,2,29,3],[30,2,30,3],[31,2,31,3],[32,2,32,3],[33,2,33,3]]}
[]
[]
[]
[]
[]
[null,{"$f":"'INFORMACIÓN INICIAL'!D15","v":0}]
[]
[]
{"$rows_left_out":29}
{"sheet":"UE 7","index":25,"n_rows":36,"n_cols":7,"rows_kept":36,"cut":false,"hidden":false,"merged":[[34,2,34,3],[35,2,35,3],[28,2,28,4],[29,2,29,3],[30,2,30,3],[31,2,31,3],[32,2,32,3],[33,2,33,3]]}
[]
[]
[]
[]
[]
[null,{"$f":"'INFORMACIÓN INICIAL'!D16","v":0}]
[]
[]
{"$rows_left_out":29}
{"sheet":"UE 8","index":26,"n_rows":36,"n_cols":7,"rows_kept":36,"cut":false,"hidden":false,"merged":[[34,2,34,3],[35,2,35,3],[28,2,28,4],[29,2,29,3],[30,2,30,3],[31,2,31,3],[32,2,32,3],[33,2,33,3]]}
[]
[]
[]
[]
[]
[null,{"$f":"'INFORMACIÓN INICIAL'!D17","v":0}]
[]
[]
{"$rows_left_out":29}
{"sheet":"UE 9","index":27,"n_rows":36,"n_cols":7,"rows_kept":36,"cut":false,"hidden":false,"merged":[[34,2,34,3],[35,2,35,3],[28,2,28,4],[29,2,29,3],[30,2,30,3],[31,2,31,3],[32,2,32,3],[33,2,33,3]]}
[]
[]
[]
[]
[]
[null,{"$f":"'INFORMACIÓN INICIAL'!D18","v":0}]
[]
[]
{"$rows_left_out":29}
{"sheet":"UE 10","index":28,"n_rows":36,"n_cols":7,"rows_kept":36,"cut":false,"hidden":false,"merged":[[34,2,34,3],[35,2,35,3],[28,2,28,4],[29,2,29,3],[30,2,30,3],[31,2,31,3],[32,2,32,3],[33,2,33,3]]}
[]
[]
[]
[]
[]
[null,{"$f":"'INFORMACIÓN INICIAL'!D19","v":0}]
[]
[]
{"$rows_left_out":29}
{"sheet":"UE 11","index":29,"n_rows":36,"n_cols":7,"rows_kept":36,"cut":false,"hidden":false,"merged":[[34,2,34,3],[35,2,35,3],[28,2,28,4],[29,2,29,3],[30,2,30,3],[31,2,31,3],[32,2,32,3],[33,2,33,3]]}
[]
[]
[]
[]
[]
[null,{"$f":"'INFORMACIÓN INICIAL'!D20","v":0}]
[]
[]
{"$rows_left_out":29}
{"sheet":"UE 12","index":30,"n_rows":36,"n_cols":7,"rows_kept":36,"cut":false,"hidden":false,"merged":[[34,2,34,3],[35,2,35,3],[28,2,28,4],[29,2,29,3],[30,2,30,3],[31,2,31,3],[32,2,32,3],[33,2,33,3]]}
[]
[]
[]
[]
[]
[null,{"$f":"'INFORMACIÓN INICIAL'!D21","v":0}]
[]
[]
{"$rows_left_out":29}
{"sheet":"Tablero de Actividades","index":31,"n_rows":115,"n_cols":22,"rows_kept":115,"cut":false,"hidden":false,"merged":[[110,7,110,8],[111,7,111,8],[112,7,112,8],[113,7,113,8],[114,7,114,8],[110,4,110,6],[111,4,111,6],[112,4,112,6],[113,4,113,6],[114,4,114,6],[1,3,2,5],[5,20,5,21],[4,20,4,21],[108,3,108,4],[109,4,109,6],[109,7,109,8]]}
["Columna1"]
[null,null,null,null,null,null,"Publico Objetivo"]
[null,null,null,null,null,null,"*mesa"]
[]
[null,null,"Desencadenante","Dimensión o impacto asociado","ID","Actividad","Objetivo","Ejecutada","Resumen de la actividad","Tipo de actividad","Conteo tipo de actividad",null,null,null,null,"Publico Objetivo",null,null,null,null,"Tipo de actividad"]
[null,null,{"$f":"IF(E6<>\" \",ACTIVIDADES!I11,\" \")","v":" "},{"$f":"IF(E6<>\" \",ACTIVIDADES!J11,\" \")","v":" "},{"$f":"IF(ACTIVIDADES!C11<>0,ACTIVIDADES!C11,\" \")","v":" "},{"$f":"IF(ACTIVIDADES!H11<>0,ACTIVIDADES!H11,\" \")","v":" "},{"$f":"IF((AND(ACTIVIDADES!C11<>0,ACTIVIDADES!K11<>0)),ACTIVIDADES!K11,\" \")","v":" "},{"$f":"IF(ACTIVIDADES!N11<>0,ACTIVIDADES!N11,\"Pendiente\")","v":"SI"},{"$f":"IF(ACTIVIDADES!Q10<>0,ACTIVIDADES!Q10,\" \")","v":" "},{"$f":"IF((AND(ACTIVIDADES!C11<>0,ACTIVIDADES!H11<>0)),ACTIVIDADES!G11,\"Sin definir\")","v":"Sin definir"},null,null,null,null,null,{"$f":"IF(ACTIVIDADES!L10<>0,ACTIVIDADES!L10,\" \")","v":" "},null,null,null,null,"Tipo de actividad"]
[null,null,{"$f":"IF(E7<>\" \",ACTIVIDADES!I12,\" \")","v":" "},{"$f":"IF(E7<>\" \",ACTIVIDADES!J12,\" \")","v":" "},{"$f":"IF(ACTIVIDADES!C12<>0,ACTIVIDADES!C12,\" \")","v":" "},{"$f":"IF(ACTIVIDADES!H12<>0,ACTIVIDADES!H12,\" \")","v":" "},{"$f":"IF((AND(ACTIVIDADES!C12<>0,ACTIVIDADES!K12<>0)),ACTIVIDADES!K12,\" \")","v":" "},{"$f":"IF(ACTIVIDADES!N12<>0,ACTIVIDADES!N12,\"Pendiente\")","v":"Pendiente"},{"$f":"IF(ACTIVIDADES!Q11<>0,ACTIVIDADES!Q11,\" \")","v":" "},{"$f":"IF((AND(ACTIVIDADES!C12<>0,ACTIVIDADES!H12<>0)),ACTIVIDADES!G12,\"Sin definir\")","v":"Sin definir"},null,null,null,null,null,{"$f":"IF(ACTIVIDADES!L11<>0,ACTIVIDADES!L11,\" \")","v":" "},null,null,null,null,"Comunicación",{"$f":"K108","v":0}]
[null,null,{"$f":"IF(E8<>\" \",ACTIVIDADES!I13,\" \")","v":" "},{"$f":"IF(E8<>\" \",ACTIVIDADES!J13,\" \")","v":" "},{"$f":"IF(ACTIVIDADES!C13<>0,ACTIVIDADES!C13,\" \")","v":" "},{"$f":"IF(ACTIVIDADES!H13<>0,ACTIVIDADES!H13,\" \")","v":" "},{"$f":"IF((AND(ACTIVIDADES!C13<>0,ACTIVIDADES!K13<>0)),ACTIVIDADES!K13,\" \")","v":" "},{"$f":"IF(ACTIVIDADES!N13<>0,ACTIVIDADES!N13,\"Pendiente\")","v":"Pendiente"},{"$f":"IF(ACTIVIDADES!Q12<>0,ACTIVIDADES!Q12,\" \")","v":" "},{"$f":"IF((AND(ACTIVIDADES!C13<>0,ACTIVIDADES!H13<>0)),ACTIVIDADES!G13,\"Sin definir\")","v":"Sin definir"},null,null,null,null,null,{"$f":"IF(ACTIVIDADES!L12<>0,ACTIVIDADES!L12,\" \")","v":" "},null,null,null,null,"Capacitación",{"$f":"L108","v":0}]
{"$rows_left_out":108}
{"sheet":"Tablero de impactos","index":32,"n_rows":114,"n_cols":18,"rows_kept":114,"cut":false,"hidden":false,"merged":[[5,11,5,17]]}
[]
[]
[null,null,null,"Tablero de IMPACTOS "]
[]
[]
[null,null,null,"Id ","Trámite relacionado","Capacidad impactada","Tipo de impacto","Descripción del impacto ","Momento del impacto","Actividad planificada","ID Actividad","Sumatoria de impactos"]
[null,null,null,{"$f":"IMPACTOS!C11","v":0},{"$f":"IF(AND(D7<>0,IMPACTOS!D11<>0),IMPACTOS!D11,\" \")","v":" "},{"$f":"IF(AND(D7<>0,IMPACTOS!G11<>0),IMPACTOS!G11,\" \")","v":" "},{"$f":"IF(AND(D7<>0,IMPACTOS!I11<>0),IMPACTOS!I11,\" \")","v":" "},{"$f":"IF(AND(D7<>0,IMPACTOS!H11<>0),IMPACTOS!H11,\" \")","v":" "},{"$f":"IF(AND(D7<>0,IMPACTOS!K11<>0),IMPACTOS!K11,\" \")","v":" "},{"$f":"IF(K7<>\"\",\"SI\",\"NO\")","v":"SI"},{"$f":"IFERROR(IF(D7<>0,VLOOKUP(D7,'Tablas Tablero'!$B$3:$C$100,2,FALSE),\" \"),\"\")","v":" "},{"$f":"SUM(LEN(F7)-LEN(SUBSTITUTE(F7,\"Procesos\",\"\")))/LEN(\"Procesos\")","v":0},{"$f":"SUM(LEN(F7)-LEN(SUBSTITUTE(F7,\"Estrucutra\",\"\")))/LEN(\"Estrucutra\")","v":0},{"$f":"SUM(LEN(F7)-LEN(SUBSTITUTE(F7,\"Infraestrucutra\",\"\")))/LEN(\"Infraestrucutra\")","v":0},{"$f":"SUM(LEN(F7)-LEN(SUBSTITUTE(F7,\"Personas\",\"\")))/LEN(\"Personas\")","v":0},{"$f":"SUM(LEN(F7)-LEN(SUBSTITUTE(F7,\"Cultura\",\"\")))/LEN(\"Cultura\")","v":0},{"$f":"SUM(LEN(F7)-LEN(SUBSTITUTE(F7,\"Poder\",\"\")))/LEN(\"Poder\")","v":0},{"$f":"SUM(LEN(F7)-LEN(SUBSTITUTE(F7,\"Otra\",\"\")))/LEN(\"Otra\")","v":0}]
[null,null,null,{"$f":"IMPACTOS!#REF!","v":{"$error":"#REF!"}},{"$f":"IF(AND(D8<>0,IMPACTOS!#REF!<>0),IMPACTOS!#REF!,\" \")","v":{"$error":"#REF!"}},{"$f":"IF(AND(D8<>0,IMPACTOS!#REF!<>0),IMPACTOS!#REF!,\" \")","v":{"$error":"#REF!"}},{"$f":"IF(AND(D8<>0,IMPACTOS!#REF!<>0),IMPACTOS!#REF!,\" \")","v":{"$error":"#REF!"}},{"$f":"IF(AND(D8<>0,IMPACTOS!#REF!<>0),IMPACTOS!#REF!,\" \")","v":{"$error":"#REF!"}},{"$f":"IF(AND(D8<>0,IMPACTOS!#REF!<>0),IMPACTOS!#REF!,\" \")","v":{"$error":"#REF!"}},{"$f":"IF(K8<>\"\",\"SI\",\"NO\")","v":"NO"},{"$f":"IFERROR(IF(D8<>0,VLOOKUP(D8,'Tablas Tablero'!$B$3:$C$100,2,FALSE),\" \"),\"\")","v":""},{"$error":"#REF!"},{"$error":"#REF!"},{"$error":"#REF!"},{"$error":"#REF!"},{"$error":"#REF!"},{"$error":"#REF!"},{"$error":"#REF!"}]
{"$rows_left_out":107}
{"sheet":"Tablero de Seguimiento","index":33,"n_rows":76,"n_cols":270,"rows_kept":76,"cut":false,"hidden":false,"merged":[[3,7,3,11],[4,0,4,6],[5,8,5,9],[5,11,5,12],[5,14,5,15],[5,17,5,18],[5,20,5,21],[5,23,5,24],[5,26,5,27],[5,29,5,30],[7,0,13,0],[7,1,13,1],[7,4,13,4],[7,8,13,8],[7,9,13,9],[7,11,13,11],[7,30,13,30],[14,0,19,0],[14,1,19,1],[14,4,19,4],[14,8,19,8],[14,9,19,9],[14,14,19,14],[14,15,19,15],[14,17,19,17],[14,18,19,18],[7,21,13,21],[7,23,13,23],[7,24,13,24],[7,26,13,26],[7,27,13,27],[7,29,13,29],[7,12,13,12],[7,14,13,14],[7,15,13,15],[7,17,13,17],[7,18,13,18],[7,20,13,20],[14,29,19,29],[14,30,19,30],[20,0,24,0],[20,1,24,1],[20,4,24,4],[20,8,24,8],[20,9,24,9],[20,11,24,11],[20,12,24,12],[20,14,24,14],[14,20,19,20],[14,21,19,21],[14,23,19,23],[14,24,19,24],[14,26,19,26],[14,27,19,27],[20,24,24,24],[20,26,24,26],[20,27,24,27],[20,29,24,29],[20,30,24,30],[25,0,31,0],[25,1,31,1],[25,4,31,4],[25,8,31,8],[25,9,31,9],[20,15,24,15],[20,17,24,17],[20,18,24,18],[20,20,24,20],[20,21,24,21],[20,23,24,23],[25,29,31,29],[25,30,31,30],[25,21,31,21],[25,23,31,23],[25,24,31,24],[25,26,31,26],[25,27,31,27],[32,0,36,0],[32,1,36,1],[32,4,36,4],[32,8,36,8],[32,9,36,9],[32,11,36,11],[32,12,36,12],[32,14,36,14],[25,20,31,20],[25,11,31,11],[25,12,31,12],[25,14,31,14],[25,15,31,15],[25,17,31,17],[25,18,31,18],[32,24,36,24],[32,26,36,26],[32,27,36,27],[32,29,36,29],[32,30,36,30],[37,0,41,0],[37,1,41,1],[37,4,41,4],[37,8,41,8],[37,9,41,9],[32,15,36,15],[32,17,36,17],[32,18,36,18],[32,20,36,20],[32,21,36,21],[32,23,36,23],[37,29,41,29],[37,30,41,30],[37,20,41,20],[37,21,41,21],[37,23,41,23],[37,24,41,24],[37,26,41,26],[37,27,41,27],[37,11,41,11],[37,12,41,12],[37,14,41,14],[37,15,41,15],[37,17,41,17],[37,18,41,18],[25,3,31,3],[32,3,36,3],[37,3,41,3],[6,1,6,2],[7,2,13,2],[14,2,19,2],[20,2,24,2],[25,2,31,2],[32,2,36,2],[37,2,41,2],[7,3,13,3],[14,3,19,3],[20,3,24,3]]}
[]
[null,"Tablero de seguimiento"]
[]
[null,null,null,null,null,null,null,"Seleccione entre los valores desplegables (1 = Mal, 2 = Regular, 3 = Bien, 4=Muy Bien)"]
[]
[null,null,null,null,null,null,null,"Fecha incial","Participantes: ",null,"Situación al","Participantes:",null,"Situación al","Participantes:",null,"Situación al","Participantes:",null,"Situación al","Participantes:",null,"Situación al","Participantes:",null,"Situación al","Participantes:",null,"Situación al","Participantes:"]
["Dimensión clave","Estado de partida",null,"Estrategia base","Situación actual","Items","Situación actual","2018-08-21","Notas","Estrategia",{"$f":"WORKDAY(H7,25)","v":"2018-09-25"},"Notas","Estrategia",{"$f":"WORKDAY(K7,25)","v":"2018-10-30"},"Notas","Estrategia",{"$f":"WORKDAY(N7,25)","v":"2018-12-04"},"Notas","Estrategia",{"$f":"WORKDAY(Q7,25)","v":"2019-01-08"},"Notas","Estrategia",{"$f":"WORKDAY(T7,25)","v":"2019-02-12"},"Notas","Estrategia",{"$f":"WORKDAY(W7,25)","v":"2019-03-19"},"Notas","Estrategia",{"$f":"WORKDAY(Z7,25)","v":"2019-04-23"},"Notas","Estrategia"]
[{"$f":"Tablas!B206","v":"EQUIPO transversal"},{"$f":"IF('DIAGNOSTICO DEL INCISO'!E19<>0,'DIAGNOSTICO DEL INCISO'!E19,\" \")","v":" "},{"$f":"IF('DIAGNOSTICO DEL INCISO'!F19<>0,'DIAGNOSTICO DEL INCISO'!F19,\" \")","v":" "},{"$f":"IF('DIAGNOSTICO DEL INCISO'!H19<>0,'DIAGNOSTICO DEL INCISO'!H19,\" \")","v":" "},{"$f":"G14","v":3.8333333333333335},"Se ha conformado un equipo transversal en la organización.",{"$f":"HLOOKUP(MAX($H$7:$W$7),H8:W8,1)","v":4},1,null,null,2,null,null,3,null,null,4,null,null,3,null,null,4]
{"$rows_left_out":69}
{"sheet":"Tablas Tablero","index":34,"n_rows":100,"n_cols":13,"rows_kept":100,"cut":false,"hidden":false,"merged":[]}
[]
[null,"IMPACTO","ACTIVIDAD","Imp_filtro","Tipo de impacto","Tipo de activividad",null,null,null,"Comunicación","Capacitación","Gestión de personas","Organización del trabajo"]
[null,{"$f":"ACTIVIDADES!J11","v":0},{"$f":"ACTIVIDADES!C11","v":0},{"$f":"IF(B3=0,\" \",IF(B3='UE 1'!$B$31,\" \",IF('Tablas Tablero'!B3=Tablas!$B$206,\" \",IF('Tablas Tablero'!B3=Tablas!$B$207,\" \",IF('Tablas Tablero'!B3=Tablas!$B$208,\" \",IF('Tablas Tablero'!B3=Tablas!$B$209,\" \",IF('Tablas Tablero'!B3=Tablas!$B$210,\" \",IF('Tablas Tablero'!B3=Tablas!$B$211,\" \",'Tablas Tablero'!B3))))))))","v":" "},{"$f":"IFERROR(IF(B3=0,\" \",(VLOOKUP(D3,IMPACTOS!$C$11:$I$129,5,FALSE))),\"\")","v":" "},{"$f":"IF(B3=0,\" \",(VLOOKUP(C3,ACTIVIDADES!$C$11:$G$124,5,FALSE)))","v":" "},null,null,"Procesos del organismo",{"$f":"COUNTIFS($E$3:$E$100,I3,$F$3:$F$100,$J$2)","v":0},{"$f":"COUNTIFS($E$3:$E$100,I3,$F$3:$F$100,$K$2)","v":0},{"$f":"COUNTIFS($E$3:$E$100,I3,$F$3:$F$100,$L$2)","v":0},{"$f":"COUNTIFS($E$3:$E$100,I3,$F$3:$F$100,$M$2)","v":0}]
[null,{"$f":"ACTIVIDADES!#REF!","v":{"$error":"#REF!"}},{"$f":"ACTIVIDADES!#REF!","v":{"$error":"#REF!"}},{"$f":"IF(B4=0,\" \",IF(B4='UE 1'!$B$31,\" \",IF('Tablas Tablero'!B4=Tablas!$B$206,\" \",IF('Tablas Tablero'!B4=Tablas!$B$207,\" \",IF('Tablas Tablero'!B4=Tablas!$B$208,\" \",IF('Tablas Tablero'!B4=Tablas!$B$209,\" \",IF('Tablas Tablero'!B4=Tablas!$B$210,\" \",IF('Tablas Tablero'!B4=Tablas!$B$211,\" \",'Tablas Tablero'!B4))))))))","v":{"$error":"#REF!"}},{"$f":"IFERROR(IF(B4=0,\" \",(VLOOKUP(D4,IMPACTOS!$C$11:$I$129,5,FALSE))),\"\")","v":""},{"$f":"IF(B4=0,\" \",(VLOOKUP(C4,ACTIVIDADES!$C$11:$G$124,5,FALSE)))","v":{"$error":"#REF!"}},null,null,"Estrucutra organizativa",{"$f":"COUNTIFS($E$3:$E$100,I4,$F$3:$F$100,$J$2)","v":0},{"$f":"COUNTIFS($E$3:$E$100,I4,$F$3:$F$100,$K$2)","v":0},{"$f":"COUNTIFS($E$3:$E$100,I4,$F$3:$F$100,$L$2)","v":0},{"$f":"COUNTIFS($E$3:$E$100,I4,$F$3:$F$100,$M$2)","v":0}]
[null,{"$f":"ACTIVIDADES!#REF!","v":{"$error":"#REF!"}},{"$f":"ACTIVIDADES!#REF!","v":{"$error":"#REF!"}},{"$f":"IF(B5=0,\" \",IF(B5='UE 1'!$B$31,\" \",IF('Tablas Tablero'!B5=Tablas!$B$206,\" \",IF('Tablas Tablero'!B5=Tablas!$B$207,\" \",IF('Tablas Tablero'!B5=Tablas!$B$208,\" \",IF('Tablas Tablero'!B5=Tablas!$B$209,\" \",IF('Tablas Tablero'!B5=Tablas!$B$210,\" \",IF('Tablas Tablero'!B5=Tablas!$B$211,\" \",'Tablas Tablero'!B5))))))))","v":{"$error":"#REF!"}},{"$f":"IFERROR(IF(B5=0,\" \",(VLOOKUP(D5,IMPACTOS!$C$11:$I$129,5,FALSE))),\"\")","v":""},{"$f":"IF(B5=0,\" \",(VLOOKUP(C5,ACTIVIDADES!$C$11:$G$124,5,FALSE)))","v":{"$error":"#REF!"}},null,null,"Infraestrucutra y tecnología",0,0,0,0]
[null,{"$f":"ACTIVIDADES!#REF!","v":{"$error":"#REF!"}},{"$f":"ACTIVIDADES!#REF!","v":{"$error":"#REF!"}},{"$f":"IF(B6=0,\" \",IF(B6='UE 1'!$B$31,\" \",IF('Tablas Tablero'!B6=Tablas!$B$206,\" \",IF('Tablas Tablero'!B6=Tablas!$B$207,\" \",IF('Tablas Tablero'!B6=Tablas!$B$208,\" \",IF('Tablas Tablero'!B6=Tablas!$B$209,\" \",IF('Tablas Tablero'!B6=Tablas!$B$210,\" \",IF('Tablas Tablero'!B6=Tablas!$B$211,\" \",'Tablas Tablero'!B6))))))))","v":{"$error":"#REF!"}},{"$f":"IFERROR(IF(B6=0,\" \",(VLOOKUP(D6,IMPACTOS!$C$11:$I$129,5,FALSE))),\"\")","v":""},{"$f":"IF(B6=0,\" \",(VLOOKUP(C6,ACTIVIDADES!$C$11:$G$124,5,FALSE)))","v":{"$error":"#REF!"}},null,null,"Personas",0,0,0,0]
[null,{"$f":"ACTIVIDADES!#REF!","v":{"$error":"#REF!"}},{"$f":"ACTIVIDADES!#REF!","v":{"$error":"#REF!"}},{"$f":"IF(B7=0,\" \",IF(B7='UE 1'!$B$31,\" \",IF('Tablas Tablero'!B7=Tablas!$B$206,\" \",IF('Tablas Tablero'!B7=Tablas!$B$207,\" \",IF('Tablas Tablero'!B7=Tablas!$B$208,\" \",IF('Tablas Tablero'!B7=Tablas!$B$209,\" \",IF('Tablas Tablero'!B7=Tablas!$B$210,\" \",IF('Tablas Tablero'!B7=Tablas!$B$211,\" \",'Tablas Tablero'!B7))))))))","v":{"$error":"#REF!"}},{"$f":"IFERROR(IF(B7=0,\" \",(VLOOKUP(D7,IMPACTOS!$C$11:$I$129,5,FALSE))),\"\")","v":""},{"$f":"IF(B7=0,\" \",(VLOOKUP(C7,ACTIVIDADES!$C$11:$G$124,5,FALSE)))","v":{"$error":"#REF!"}},null,null,"Cultura",0,0,0,0]
[null,{"$f":"ACTIVIDADES!#REF!","v":{"$error":"#REF!"}},{"$f":"ACTIVIDADES!#REF!","v":{"$error":"#REF!"}},{"$f":"IF(B8=0,\" \",IF(B8='UE 1'!$B$31,\" \",IF('Tablas Tablero'!B8=Tablas!$B$206,\" \",IF('Tablas Tablero'!B8=Tablas!$B$207,\" \",IF('Tablas Tablero'!B8=Tablas!$B$208,\" \",IF('Tablas Tablero'!B8=Tablas!$B$209,\" \",IF('Tablas Tablero'!B8=Tablas!$B$210,\" \",IF('Tablas Tablero'!B8=Tablas!$B$211,\" \",'Tablas Tablero'!B8))))))))","v":{"$error":"#REF!"}},{"$f":"IFERROR(IF(B8=0,\" \",(VLOOKUP(D8,IMPACTOS!$C$11:$I$129,5,FALSE))),\"\")","v":""},{"$f":"IF(B8=0,\" \",(VLOOKUP(C8,ACTIVIDADES!$C$11:$G$124,5,FALSE)))","v":{"$error":"#REF!"}},null,null,"Poder",0,0,0,0]
{"$rows_left_out":92}